{"text_format":"1","workbook":"xlsx","n_sheets":12,"sheets":["Bilgi Girişi","Bordro1","Hesaplamalar","Tablo","Ödeme Emri","Değerler Tablosu","Asg Geç İnd","Vergi","Son 4 Yıl","Derece Kademe","Bordro","Sayfa1"],"not_rendered":{"charts":0,"images":0,"macros":1,"external_links":0,"defined_names":9,"comments":5,"pivot_tables":0},"unopened":[],"bounds":{"document_bytes":16777216,"sheet_cells":100000,"rows_first":2000,"rows_last":500,"rows_between":2000,"halvings":0,"cell_chars":16384,"cell_head_chars":4096},"cells_cut":0,"cells_raw":0,"read":"whole","date_system":"1900"}

{"sheet":"Bilgi Girişi","index":0,"n_rows":163,"n_cols":12,"rows_kept":163,"cut":false,"hidden":false,"merged":[[12,6,12,7],[17,10,17,11],[18,10,18,11],[22,10,22,11],[19,10,19,11],[20,10,20,11],[33,6,33,7],[25,10,25,11],[24,10,24,11],[29,6,29,7],[26,10,26,11],[24,6,24,7],[30,6,30,7],[31,6,31,7],[1,5,1,9],[2,6,2,9],[11,6,11,7],[5,5,5,11],[6,10,6,11],[6,6,6,7],[10,10,10,11],[4,5,4,11],[7,6,7,7],[10,6,10,7],[8,6,8,7],[9,6,9,7],[7,10,7,11],[8,10,8,11],[9,10,9,11],[36,8,36,9],[13,10,13,11],[16,6,16,7],[14,10,14,11],[19,6,19,7],[15,6,15,7],[14,6,14,7],[28,6,28,7],[23,6,23,7],[27,6,27,7],[22,6,22,7],[26,6,26,7],[25,6,25,7],[34,6,34,7],[15,10,15,11],[32,6,32,7]]}
[]
[null,null,null,null,null,"Hesaplamaya İlişkin Mevcut Maaş ve Kişisel Bilgilerinizi Aşağıdaki Personel Bilgileri Alanına Giriniz",null,null,null,null,"Bu Ödeme Kıst Maaş mı?"]
[null,null,null,null,null,"Kurum :",null,null,null,null,"Ay Günü:",30]
[null,null,{"$f":"IF(F4=\"\",0,1)","v":1},null,1,"Ay / YIL",null,{"$f":"+'Değerler Tablosu'!E5","v":2018},"Birim",null,"Bordro Günü",30]
[null,null,null,null,null,"Personel Bilgileri"]
[null,null,null,null,null,"KİŞİSEL BİLGİLER"]
[null,{"$f":"IF(J7=0,0,1)","v":1},{"$f":"IF(F7=\"\",0,1)","v":0},0,{"$f":"IF(F7=\"\",0,SUM($C$4:C7))","v":0},{"$f":"IF(G4=\"\",\"\",\"Personel Durumu\")","v":""},null,null,{"$f":"IF(B7=0,0,IF(J7=\"\",\"\",SUM($C$4:C40)+SUM($B$4:B7)))","v":""},{"$f":"IF(G7=\"\",\"\",IF(G15='Bilgi Girişi'!F92,0,\"Özel Hizmet Tazminatı Oranı %\"))","v":""}]
[null,{"$f":"IF(J8=0,0,1)","v":1},0,null,{"$f":"IF(F8=\"\",0,SUM($C$4:C8))","v":0},{"$f":"IF(G7=\"\",\"\",\"T.C. Kimlik Numarası\")","v":""},null,null,{"$f":"IF(B8=0,0,IF(J8=\"\",\"\",SUM($C$4:C41)+SUM($B$4:B8)))","v":""},{"$f":"IF(G7=\"\",\"\",IF(G15='Bilgi Girişi'!F92,0,\"Mali Sorumluk Zammı Puanı\"))","v":""}]
{"$rows_left_out":156}
{"sheet":"Bordro1","index":1,"n_rows":39,"n_cols":7,"rows_kept":39,"cut":false,"hidden":false,"merged":[]}
[]
[]
[]
[]
[null,"Kurumu / Birimi",0]
[null,"Ait Olduğu Ay",0]
[null,"Bütçe Yılı",0]
[null,"PERSONEL BİLGİLERİ",null,"GELİRİN",null,"KESİNTİNİN"]
{"$rows_left_out":32}
{"sheet":"Hesaplamalar","index":2,"n_rows":38,"n_cols":28,"rows_kept":38,"cut":false,"hidden":true,"merged":[[17,1,19,1],[20,5,20,6],[18,5,18,6],[19,5,19,6],[14,5,14,6],[17,3,19,3],[11,5,11,6],[5,17,5,18],[6,13,6,14],[5,9,5,10],[5,5,5,6],[8,17,8,18],[8,13,8,14],[7,9,7,10],[10,5,10,6],[6,17,6,18],[6,5,6,6],[9,5,9,6],[37,5,37,6],[7,5,7,6],[3,16,3,18],[7,17,7,18],[13,17,13,18],[24,5,24,6],[3,4,3,6],[4,12,4,14],[4,8,4,10],[13,9,13,10],[13,5,13,6],[6,9,6,10],[8,5,8,6],[33,5,33,6],[34,5,34,6],[16,5,16,6],[32,4,32,6],[29,5,29,6],[22,4,22,6],[14,9,14,10],[23,5,23,6],[27,4,27,6],[30,5,30,6],[23,9,23,10],[15,5,15,6],[20,9,20,10],[15,9,15,10],[17,9,17,10],[19,9,19,10],[17,5,17,6],[26,10,31,11],[36,5,36,6],[2,20,2,21],[4,17,4,18],[4,5,4,6],[28,4,28,6],[16,9,16,10],[14,17,14,18],[10,13,10,14],[12,13,12,14],[7,13,7,14],[5,13,5,14],[12,5,12,6],[8,9,8,10],[10,9,10,10],[12,9,12,10],[21,9,21,10]]}
[]
[]
[null,null,null,null,null,null,null,null,null,null,null,null,null,null,null,null,null,null,null,null,"KESİNTİLER"]
[null,null,null,null,"Temel Maaşlar",null,null,null,null,null,null,null,null,null,null,null,"Emekli Keseneği Hesaplamaya İlşikin Bölüm",null,null,null,"Kesintinin Adı","Tutarı",null,null,null,"Emekli Matrahları","Tutarı","Em Ek Büyükse"]
[null,null,null,null,{"$f":"IF('Bilgi Girişi'!G7=\"\",\"\",\"Yeni Aylık Göstergesi\")","v":""},{"$f":"IF(ISERROR(VLOOKUP('Bilgi Girişi'!H70,'Derece Kademe'!$N$17:$O$287,2,FALSE)),0,VLOOKUP('Bilgi Girişi'!H70,'Derece Kademe'!$N$17:$O$287,2,FALSE))","v":0},null,null,"Zam ve Tazminatlar",null,null,null,"Ödenekler",null,null,null,{"$f":"IF('Bilgi Girişi'!G7='Bilgi Girişi'!F88,\"Em.Kes.Katkı Oranı % \n'Her İki Ek Göst Eşit Olanlar'\",0)","v":0},{"$f":"IF('Bilgi Girişi'!G28>6400,215,IF(Q5=0,0,+T5))","v":0},null,{"$f":"LARGE('Değerler Tablosu'!I45:I52,1)","v":55},{"$f":"IF('Bilgi Girişi'!G7=\"\",\"\",\"Bu Ay Vergi Matrahınız\")","v":""},{"$f":"IF(F5>0,SUM((F6+F18+F13+F15+M30+N6)-(V16+Z24+Z28+V21+V17+V22+F37)),SUM((F6+F18+F13+F15+J8+N6)-(V16+Z24+Z28+V21+V17+V22+F37)))","v":0},null,null,null,{"$f":"IF('Bilgi Girişi'!G7='Bilgi Girişi'!F88,\"Heriki Ek Göstregesi ve Emk Mük ile Kıdem Aynı Olanlar için Em.Kes.Karşılığı  % 20 (Devlet K.Matrahı)\",0)","v":0},{"$f":"IF(AND('Bilgi Girişi'!G7='Bilgi Girişi'!F88,'Bilgi Girişi'!L2=\"Evet\"),0,IF('Bilgi Girişi'!G7='Bilgi Girişi'!F89,0,(F10+F13+F16+R6+F19)))","v":0},{"$f":"IF(AND('Bilgi Girişi'!G7='Bilgi Girişi'!F88,'Bilgi Girişi'!L2=\"Evet\"),0,IF('Bilgi Girişi'!G7='Bilgi Girişi'!F89,0,(F10+F13+F16+R9+F21)))","v":0}]
[null,null,null,null,{"$f":"IF('Bilgi Girişi'!G7=\"\",\"\",\"Aylık Tutar (Ödemeye Esas)\")","v":""},{"$f":"ROUND((IF(ISERROR(((F5*'Değerler Tablosu'!E6)/'Bilgi Girişi'!L3)*'Bilgi Girişi'!L4),0,(F5*'Değerler Tablosu'!E6)/'Bilgi Girişi'!L3)*'Bilgi Girişi'!L4),2)","v":0},null,null,{"$f":"IF('Bilgi Girişi'!G7=\"\",\"\",IF('Bilgi Girişi'!J7=0,0,\"Ödemeye Esas Özel Hizmet Tazminatı Tutarı\"))","v":""},{"$f":"ROUND(((((9500*'Değerler Tablosu'!E6)/100)*'Bilgi Girişi'!K7)/'Bilgi Girişi'!L3)*'Bilgi Girişi'!L4,2)","v":0},null,null,{"$f":"IF('Bilgi Girişi'!K17=\"Evet\",\"İdari Görev Tutarı\",0)","v":0},{"$f":"ROUND((((F5+'Bilgi Girişi'!G28)*'Değerler Tablosu'!E6)*'Bilgi Girişi'!L17)/100,2)","v":0},null,null,{"$f":"IF('Bilgi Girişi'!G7='Bilgi Girişi'!F88,\"Em.Kes.Katkı Tutarı\n'Her İki Göstergesi Eşit Olanlar'\",0)","v":0},{"$f":"IF(C7=C8,0,ROUND(IF(Q6=0,0,('Değerler Tablosu'!E6*9500)*R5)/100,2))","v":0},null,null,{"$f":"IF('Bilgi Girişi'!G7=\"\",\"\",\"Sakatlık İndirimi  Tutarı TL\")","v":""},{"$f":"+Z28","v":0},null,null,null,{"$f":"IF('Bilgi Girişi'!G7='Bilgi Girişi'!F88,\"Heriki Ek Göstregesi ve Emk Mük ile Kıdem Aynı Olanlar için Em.Kes.Karşılığı  % 20 (Devlet)\",0)","v":0},{"$f":"IF('Bilgi Girişi'!G7='Bilgi Girişi'!F89,0,ROUND(IF(AA5=0,0,(AA5*0.2)),2))","v":0}]
[null,null,{"$f":"CONCATENATE('Bilgi Girişi'!G7,'Bilgi Girişi'!L2)","v":""},null,{"$f":"IF('Bilgi Girişi'!G7=\"\",\"\",\"Eski Aylık Göstergesi\")","v":""},{"$f":"IF(ISERROR(VLOOKUP('Bilgi Girişi'!H71,'Derece Kademe'!$N$17:$O$287,2,FALSE)),0,VLOOKUP('Bilgi Girişi'!H71,'Derece Kademe'!$N$17:$O$287,2,FALSE))","v":0},null,null,{"$f":"IF('Bilgi Girişi'!G7=\"\",\"\",IF('Bilgi Girişi'!J8=0,0,\"Emkliye Esas Özel Hizmet Tazminatı Tutarı\"))","v":""},{"$f":"ROUND(((((9500*'Değerler Tablosu'!E6)/100)*'Bilgi Girişi'!K7)/30)*'Bilgi Girişi'!L4,2)","v":0},null,null,{"$f":"IF('Bilgi Girişi'!J18=0,0,\"Üniversite Ödeneği Tutarı\")","v":0},{"$f":"IF(M7=0,0,ROUND(IF('Bilgi Girişi'!K18=\"\",0,(((9500*'Değerler Tablosu'!E6)*'Bilgi Girişi'!K18)/100)/'Bilgi Girişi'!L3)*'Bilgi Girişi'!L4,2))","v":0},null,null,{"$f":"IF(R7=0,0,\"Emekliye Esas Ek Gösterge Tutarı 'Ödemeye Esas Ek Göstergesi Aynı Olanlar'\")","v":0},{"$f":"IF('Bilgi Girişi'!G7='Bilgi Girişi'!F89,0,IF(C7=C8,0,IF('Bilgi Girişi'!G28='Bilgi Girişi'!G29,('Bilgi Girişi'!G30*'Değerler Tablosu'!E6),0)))","v":0},null,null,{"$f":"IF('Bilgi Girişi'!G7=\"\",\"\",\"Toplam Vergi Matrahınız\")","v":""},{"$f":"'Bilgi Girişi'!G34+V5","v":0},null,null,null,{"$f":"IF('Bilgi Girişi'!G7=\"\",\"\",IF('Bilgi Girişi'!G7='Bilgi Girişi'!F89,0,\"Gen.Sag.Sig.Pir.( ) Devlet K.Matrahı) % 12\"))","v":""},{"$f":"+AA5","v":0}]
[null,null,"01/10/2008 Den Önceki PersonelEvet",null,{"$f":"IF('Bilgi Girişi'!G7=\"\",\"\",\"Yeni Emekliye Esas Aylık Göstergesi\")","v":""},{"$f":"IF(C7=C8,0,IF(ISERROR(VLOOKUP('Bilgi Girişi'!H72,'Derece Kademe'!N17:O290,2,FALSE)),0,VLOOKUP('Bilgi Girişi'!H72,'Derece Kademe'!N17:O290,2,FALSE)))","v":0},null,null,{"$f":"IF('Bilgi Girişi'!G7=\"\",\"\",IF('Bilgi Girişi'!J11=0,0,\"Ödenecek Yan Odemeler Toplamı\"))","v":""},{"$f":"ROUND((('Bilgi Girişi'!K11*'Değerler Tablosu'!E7)/'Bilgi Girişi'!L3)*'Bilgi Girişi'!L4,2)","v":0},null,null,{"$f":"IF('Bilgi Girişi'!J18=0,0,\"Eğitim Öğretim Ödeneği Tutarı\")","v":0},{"$f":"IF(M8=0,0,ROUND(IF('Bilgi Girişi'!K19=\"Evet\",(((9500*'Değerler Tablosu'!E6)/12)/'Bilgi Girişi'!L3)*'Bilgi Girişi'!L4,0),2))","v":0},null,null,{"$f":"IF('Bilgi Girişi'!G7='Bilgi Girişi'!F88,\"Em.Kes.Katkı Oranı %\n'Emekli Ek Göst Farklı Olanlar'\",0)","v":0},{"$f":"IF('Bilgi Girişi'!G26=\"\",0,IF(Q8=0,0,IF(AND('Bilgi Girişi'!G31>=6400,'Bilgi Girişi'!G31<=7600),195,+T8)))","v":0},null,{"$f":"LARGE('Değerler Tablosu'!K45:K52,1)","v":0},{"$f":"IF('Bilgi Girişi'!G7=\"\",\"\",\"Geçerli Vergi Oranınız %\")","v":""},{"$f":"IF(V7=0,0,+Vergi!C21)","v":0},null,null,null,{"$f":"IF('Bilgi Girişi'!G7=\"\",\"\",IF('Bilgi Girişi'!G7='Bilgi Girişi'!F89,0,\"Gen.Sag.Sig.Pir.(Ek Göst Aynı İse ) Devlet K.Matrahı) % 12\"))","v":""},{"$f":"IF('Bilgi Girişi'!G7='Bilgi Girişi'!F89,0,IF(C7=C8,0,IF(Z8=0,0,ROUND(IF(R7=0,(F20+F13+F17+R9),(F20+F13+F17+R6)),2))))","v":0}]
{"$rows_left_out":31}
{"sheet":"Tablo","index":3,"n_rows":65,"n_cols":20,"rows_kept":65,"cut":false,"hidden":false,"merged":[[61,19,61,20],[62,19,64,20],[62,13,64,13],[62,14,63,14],[62,15,64,15],[62,16,63,16],[57,1,64,1],[57,4,57,5],[57,19,57,20],[58,4,58,5],[58,19,58,20],[62,17,64,17],[62,18,63,18],[62,2,63,2],[62,4,64,5],[62,6,64,6],[62,7,64,11],[62,12,64,12],[59,4,59,5],[59,19,59,20],[60,19,60,20],[61,4,61,5],[36,1,38,1],[36,19,36,20],[37,3,37,4],[37,19,37,20],[38,19,38,20],[41,1,54,1],[41,19,41,20],[42,19,42,20],[43,19,43,20],[44,19,44,20],[45,19,45,20],[46,19,46,20],[47,19,47,20],[48,19,48,20],[49,3,49,4],[49,19,49,20],[50,19,50,20],[51,19,51,20],[53,19,53,20],[54,19,54,20],[27,19,27,20],[30,1,33,1],[30,19,30,20],[31,19,31,20],[32,19,32,20],[33,19,33,20],[22,19,22,20],[23,19,23,20],[24,1,26,1],[24,19,24,20],[25,19,25,20],[26,19,26,20],[13,20,13,21],[14,1,21,1],[14,20,14,21],[15,19,15,20],[16,19,16,20],[17,19,17,21],[18,19,18,20],[19,19,19,20],[20,19,20,20],[21,19,21,21],[1,19,1,20],[2,19,2,20],[5,1,12,1],[5,19,5,20],[6,19,6,20],[7,19,7,20],[8,19,8,20],[9,19,9,20],[10,19,10,20],[11,19,11,20],[12,19,12,20]]}
[]
[null,null,null,null,null,null,null,null,null,"5510 Sayılı Kanuna Göre 4/c kapsamında 01/10/2008 den Önce Memuriyete Başlayanlar ",null,null,null,null,null,null,null," 5510 Sayılı Kanuna Göre 4/c kapsamında 01/10/2008 den Sonra Memuriyete Başlayanlar ",null,"5510 Sayılı Kanuna Göre 4/c kapsamında 01/10/2008 den Önce Memuriyete Başlayanlar "]
[null,"Harcama Gurubu",null,"Harcama Kalemi",null,"Damga Vergisi",null,"Gelir Vergisi",null,"Emekli Keseneği",null,"Tasarruf Kesintisi",null,"Döner Sermaye",null,"Vergi İndirimi",null,"Malüllük  Yaşlılık ve Ölüm  & Genel Sağlık Siğortası Primi",null,"\"01/07/2008 den itibaren 3 yıl Sonra \"  18/12/2009 tarih ve 27436 sayılıR.G Yayımlanan KAMU PERSONELİNİN GENEL SAĞLIK SİGORTASI KAPSAMINA\nALINMASI HAKKINDA TEBLİĞ 5.Maddesi\nGenel Sağlık Siğortası Primi  % 12 Tamamı İşverenden"]
[]
[]
[null,"Temel Maaşlar      (Eski 110)",null,"MAAŞ",null,"Tabi",null,"Tabi",null,"-----",null,"Tabi",null,"Tabi",null," ------",null," ------",null,"-----"]
[null,null,null,"EMEKLİ MAAŞI",null," ------",null,"----",null,"Tabi",null,"-----",null,"-----",null," ------",null,"Tabi",null,"Tabi"]
[null,null,null,"TABAN MAAŞ",null,"Tabi",null,"Tabi",null,"Tabi",null,"Tabi",null," ------",null," ------",null,"Tabi",null,"Tabi"]
{"$rows_left_out":58}
{"sheet":"Ödeme Emri","index":4,"n_rows":41,"n_cols":24,"rows_kept":41,"cut":false,"hidden":false,"merged":[[1,0,1,1],[1,2,1,12],[2,0,2,1],[2,2,2,12],[2,13,2,15],[2,16,2,18],[2,19,6,19],[2,20,2,22],[3,0,4,1],[3,7,4,12],[3,13,3,15],[3,16,3,18],[3,20,3,22],[4,13,4,15],[4,16,4,18],[4,20,4,22],[5,0,5,1],[5,2,5,18],[5,20,5,22],[6,0,6,1],[6,2,6,18],[6,20,6,22],[9,2,10,2],[9,3,10,3],[9,4,10,4],[9,6,10,6],[9,7,10,7],[9,5,10,5],[7,0,10,1],[7,2,8,6],[7,7,8,10],[9,8,10,8],[9,9,10,9],[9,10,10,10],[9,13,10,13],[9,14,10,14],[9,15,10,15],[9,16,10,16],[9,18,10,19],[9,20,10,22],[7,23,10,23],[8,11,8,12],[8,13,8,16],[8,18,8,19],[8,20,8,22],[7,11,7,12],[7,13,7,17],[7,18,7,22],[9,11,10,12],[16,18,16,19],[16,20,16,22],[11,0,11,1],[11,11,11,12],[11,18,11,19],[11,20,11,22],[15,0,15,1],[15,11,15,12],[12,20,12,22],[13,20,13,22],[14,20,14,22],[15,18,15,19],[15,20,15,22],[13,18,13,19],[21,20,21,22],[22,0,22,1],[22,11,22,12],[22,18,22,19],[17,0,17,1],[17,11,17,12],[17,18,17,19],[18,20,18,22],[17,20,17,22],[18,0,18,1],[18,11,18,12],[18,18,18,19],[22,20,22,22],[19,11,19,12],[19,18,19,19],[20,0,20,1],[20,11,20,12],[20,18,20,19],[20,20,20,22],[19,20,19,22],[19,0,19,1],[23,20,23,22],[26,0,26,1],[26,11,26,12],[24,0,24,1],[28,0,28,1],[28,11,28,12],[28,18,28,19],[28,20,28,22],[29,0,29,1],[25,0,25,1],[25,11,25,12],[25,18,25,19],[27,0,27,1],[24,20,24,22],[24,11,24,12],[24,18,24,19],[25,20,25,22],[33,0,33,16],[33,18,33,19],[12,0,12,1],[12,11,12,12],[12,18,12,19],[13,0,13,1],[13,11,13,12],[31,0,31,1],[31,11,31,12],[31,18,31,19],[32,0,32,16],[32,18,32,19],[14,0,14,1],[14,11,14,12],[14,18,14,19],[29,18,29,19],[23,0,23,1],[23,11,23,12],[23,18,23,19],[21,0,21,1],[21,11,21,12],[21,18,21,19],[16,0,16,1],[16,11,16,12],[32,20,32,22],[31,20,31,22],[27,11,27,12],[27,18,27,19],[26,18,26,19],[30,0,30,1],[30,11,30,12],[30,18,30,19],[30,20,30,22],[26,20,26,22],[29,11,29,12],[29,20,29,22],[27,20,27,22]]}
[]
["Muhasebe Birimi Kodu","","??","","",null,"","","","","","","","","","","","","","","","",""]
["Muhasebe Birimi Adı","",{"$f":"+'Bilgi Girişi'!G3","v":0},"","",null,"","","","","","","","Bütçe Yılı","","",{"$f":"+'Bilgi Girişi'!H4","v":2018},"","","İ l g i l i n i n ","Adı, Soyadı/Ünvanı","",""]
["Kurum-Birim Kodu","",1,2,3,4,5,"Yevmiyenin","","","","","","Tarihi","","","","","","","T.C./ Vergi Kimlik No","",""]
["","",38,44,0,0,908,"","","","","","","No.su","","",0,"","","","Banka Şube Adı","",""]
["Kurum Adı","",{"$f":"+C3","v":0},"","",null,"","","","","","","","","","","","","","","Banka Hesap Numarası","",""]
["Birim Adı","",{"$f":"+'Bilgi Girişi'!I4","v":"Birim"},null,null,null,null,null,null,null,null,null,null,null,null,null,null,null,null,"","Bağlı Olduğu Vergi Dairesi","",""]
["Hesap No","","Kurumsal Kod","","",null,"","Fonksiyonel Kod","","","","Finans","","Ekonomik /","","","","","T u t a r","","","","","Hesap / Ayrıntı Adı"]
{"$rows_left_out":34}
{"sheet":"Değerler Tablosu","index":5,"n_rows":81,"n_cols":26,"rows_kept":81,"cut":false,"hidden":false,"merged":[[9,24,11,24],[3,2,3,4],[7,2,7,3],[10,2,10,3],[11,2,11,3],[4,8,4,9],[5,8,5,9],[6,8,6,9],[8,9,9,9],[5,2,5,3],[4,2,4,3],[11,9,12,9],[6,2,6,3],[12,2,12,3],[8,2,8,3],[9,2,9,3],[13,2,13,3],[17,2,17,4],[18,2,18,3],[19,2,19,3],[25,2,25,3],[23,2,23,3],[24,2,24,3],[20,8,20,9],[20,2,20,3],[21,2,21,3],[18,17,18,18],[22,2,22,3],[22,23,22,24],[44,2,44,3],[39,2,39,3],[40,2,40,3],[41,2,41,3],[42,2,42,3],[43,2,43,3],[34,2,34,4],[35,2,35,3],[36,2,36,3],[37,2,37,3],[38,2,38,3],[27,2,27,3],[26,2,26,3]]}
[]
[]
[null,null,null,null,null,null,null,null,"MAKAM TAZMİNATI CETVELİ (Ek: 20/3/1997-KHK-570/7 md.)"]
[null,null,"Cari Dönem"]
[null,null,"Yıl",null,2018,null,null,null,"MAKAM TAZMİNATI",null,null,null,null,null,"Akademik",null,null,"Y.DİL TAZMİNATI",null,null,null,null,null,"             Üniversite Ödeneği"]
[null,null,"Maaş Katsayısı",null,0.10854999999999999,null,null,null,"Mak.Taz.Göst. X Maaş Katsayısı",null,null,null,null,null,"Y.DİL TAZMİNATI",null,null,"27/3/2006 tar.ve 29299 veya 23299 sy.R.G.",null,null,null,null,null," Madde 12 – (Değişik : 20/3/1997 - KHK - 570/4 md.)"]
[null,null,"Yan Ödeme Katsayısı",null,3.4424000000000003E-2,null,null,null,"(Yük.Öğrt.Personel Kan.Ek Mad.2(Ek:20/3/1997-KHK-570/7 Md.)",null,null,null,null,null,"A",900,null,"A1 İçin","100 -96  Puan",null,null,null,null,"ÜNİVERSİTE ÖDENEĞİ    (Yüksek Öğrenim Personel Kanunu 12.md.    Ve (23/2/95 tarih 547 sayılı KHK ile)"]
[null,null,"Taban Aylık Katsayısı",null,1.6991210000000001,null,null,null,"Rektör",7000,null,null,null,null,"B",600,null,"A   İçin","  90 -95  Puan",null,null,null,null,"             657 sayılı Devlet Memurları Kanununa tabi en yüksek Devlet memuru brüt aylık (ek gösterge dahil) tutarının;"]
{"$rows_left_out":74}
{"sheet":"Asg Geç İnd","index":6,"n_rows":18,"n_cols":25,"rows_kept":18,"cut":false,"hidden":false,"merged":[[1,7,1,15]]}
[]
[{"$f":"COUNTIF(A4:A33,\">0\")","v":1}]
["Sıra No","Adı Soyadı","Medeni Hali",null,"Eşi Çalışıyormu","Çocuk Sayısı","İlgili  Döneme Ait Maaşındaki Vergi Matrahı","Sakatlık İndirimi (Varsa)","GELİR VERGİSİNE TABİ GELİRİ","İlgili Dönemde Kendisinden Kesilen  Gelir Vergisi tutarı","16 Yaşından Büyükler İçin Asgari Ücret (Günlük)","16 Yaşından Büyükler İçin Asgari Ücret (Yıllık)","Asgari Geçim İndirimine Esas Tutar","Asgari Geçim İndiriminin Yıllık Tutarı","Hesaplanan Yıllık Tutarın 1/12 si","İlgili Dönemde Mükellefin (Çalışanın) Ödeyeceği Vergi Tutarı","Çalışan Personel İçin","Eşi İçin","1.Çocuk","2.Çocuk","3.Çocuk","4.Çocuk","5.Çocuk","TOPLAM İnd.Oranı","Ödenecek İndirim Tutarı"]
[1,{"$f":"+'Bilgi Girişi'!G11","v":0},{"$f":"+'Bilgi Girişi'!G12","v":0},{"$f":"MID(C4,10,10)","v":""},{"$f":"IF(A4<=0,\"\",IF(D4=\"Çalışıyor\",\"Evet\",IF(C4=\"Dul\",\"\",IF(C4=\"Bekar\",\"\",IF(D4=\"Çalışmıyor\",\"Hayır\",IF(C4=\"Evli Eşi Emekli V.İnd Yararlanıyor\",\"Hayır\",\"\"))))))","v":""},{"$f":"+'Bilgi Girişi'!G13","v":0},{"$f":"+Hesaplamalar!V5","v":0},null,{"$f":"G4-H4","v":0},{"$f":"ROUND((I4*0.15),2)","v":0},{"$f":"IF(A4<=0,0,'Değerler Tablosu'!E13)","v":67.650000000000006},{"$f":"(K4*30)*12","v":24354.000000000004},{"$f":"ROUND((L4*X4)/100,2)","v":12177},{"$f":"ROUND((M4*0.15),2)","v":1826.55},{"$f":"ROUND((N4/12),2)","v":152.21},{"$f":"IF(J4-O4<0,0,J4-O4)","v":0},{"$f":"IF(A4<=0,0,50)","v":50},{"$f":"IF(E4=\"Hayır\",10,0)","v":0},{"$f":"IF(F4=0,0,IF(F4=1,7.5,IF(F4>1,7.5)))","v":0},{"$f":"IF(F4=0,0,IF(F4>1,7.5,))","v":0},{"$f":"IF(F4>2,10,0)","v":0},{"$f":"IF(F4>3,5,0)","v":0},{"$f":"IF(F4>4,5,0)","v":0},{"$f":"SUM(Q4:W4)","v":50},{"$f":"IF('Bilgi Girişi'!L2=\"Evet\",0,IF(J4<O4,+J4,+O4))","v":0}]
[]
[]
[]
[]
{"$rows_left_out":11}
{"sheet":"Vergi","index":7,"n_rows":42,"n_cols":12,"rows_kept":42,"cut":false,"hidden":false,"merged":[[0,2,0,4],[2,4,2,5],[3,4,3,5],[4,4,4,5],[5,4,5,5]]}
[null,null,{"$f":"CONCATENATE(C2,\" \",\"Yılı İçin\")","v":"2018 Yılı İçin"}]
[null,"Yıl",2018]
[1,"1.Dilim",14800,null,{"$f":"CONCATENATE(C3,\" \",\"TL'ye kadar\",\" \",\"(0\",\"-\",C3,\".-TL)\")","v":"14800 TL'ye kadar (0-14800.-TL)"},null,0.15,null,null,null,{"$f":"ROUND(C3*0.15,2)","v":2220}]
[2,"2.Dilim",34000,null,{"$f":"CONCATENATE(C4,\"-TL'nin\",\" \",C3,\"-TL'si için\",\" \",K3,\"-TL, fazlası\",\"( \",C4,\"-\",C3,\"-TL)\")","v":"34000-TL'nin 14800-TL'si için 2220-TL, fazlası( 34000-14800-TL)"},null,0.2,null,null,null,{"$f":"ROUND((C4-C3)*0.2,2)","v":3840},{"$f":"K4+K3","v":6060}]
[3,"3:dilim",120000,null,{"$f":"CONCATENATE(C5,\"-TL'nin\",\" \",C4,\" \",\"- TL'si için\",\" \",L4,\"-TL\",\" \",\"fazlası\",\"(\",C5,\"-\",C4,\"-TL)\")","v":"120000-TL'nin 34000 - TL'si için 6060-TL fazlası(120000-34000-TL)"},null,0.27]
[null,null,null,null,{"$f":"CONCATENATE(C5,\" \",\"-TL'den fazlası\")","v":"120000 -TL'den fazlası"},null,0.35]
[]
[]
{"$rows_left_out":35}
{"sheet":"Son 4 Yıl","index":8,"n_rows":71,"n_cols":19,"rows_kept":71,"cut":false,"hidden":false,"merged":[[68,3,68,4],[68,5,68,8],[69,3,69,4],[69,5,69,8],[70,5,70,8],[41,2,41,10],[41,12,41,18],[67,3,67,4],[67,5,67,9],[51,3,51,4],[51,5,51,8],[52,3,52,4],[52,5,52,8],[53,5,53,8],[59,3,59,4],[59,5,59,9],[60,3,60,4],[60,5,60,8],[61,3,61,4],[61,5,61,8],[62,5,62,8],[43,3,43,4],[44,3,44,4],[45,3,45,4],[43,5,43,9],[44,5,44,8],[50,3,50,4],[50,5,50,9],[45,5,45,8],[46,5,46,8],[47,5,47,8],[36,12,36,14],[38,12,38,14],[34,16,34,18],[36,16,36,18],[38,16,38,18],[34,12,34,14],[33,12,33,14],[33,16,33,18],[21,2,21,18],[31,4,31,6],[31,8,31,10],[31,12,31,14],[31,16,31,18],[30,2,30,18],[22,4,22,6],[22,8,22,10],[34,4,34,6],[36,4,36,6],[38,4,38,6],[33,4,33,6],[34,8,34,10],[36,8,36,10],[38,8,38,10],[33,8,33,10],[1,2,1,18],[14,4,14,6],[22,12,22,14],[22,16,22,18],[2,4,2,6],[2,8,2,10],[2,12,2,14],[2,16,2,18],[13,2,13,18],[14,8,14,10],[14,12,14,14],[14,16,14,18]]}
[]
[null,null,"Son 4 Yıllın Katsayıları"]
[null,null,null,null,2015,null,null,null,2016,null,null,null,2017,null,null,null,2018]
[null,null,null,null,"01/01/2015 30/06/2015",null,"01/07/2015 31/12/2015",null,"01/01/2016 30/06/2016 ",null,"01/07/2016 31/12/2016 ",null,"01/01/2017 30/06/2017 ",null,"01/06/2017 31/12/2017 ",null,"01/01/2018 30/06/2018 ",null,"01/07/2018 31/12/2018 "]
[]
[null,null,"KATSAYI",null,7.9308000000000003E-2,null,8.3084000000000005E-2,null,{"$f":"G6+(G6*6.9)/100","v":8.8816796000000003E-2},null,9.3258999999999995E-2,null,9.6058000000000004E-2,null,0.10270600000000001,null,0.10854999999999999,null,0]
[]
[null,null,"YAN ÖDEME",null,2.5149000000000001E-2,null,2.6346999999999999E-2,null,{"$f":"G8+(G8*6.9)/100","v":2.8164942999999998E-2},null,2.9574E-2,null,3.0461999999999999E-2,null,3.2570000000000002E-2,null,3.4424000000000003E-2,null,0]
{"$rows_left_out":64}
{"sheet":"Derece Kademe","index":9,"n_rows":287,"n_cols":29,"rows_kept":287,"cut":false,"hidden":false,"merged":[[1,3,1,11],[2,4,2,9]]}
[]
[null,null,null,"1 Numaralı Cetvel"]
[null,null,null,null,"Aylık GÖSTERGE TABLOSU (1)",null,null,null,null,null,null,null,null,null,null,null,null,null,"7600 (Dahil) - 8400 (Hariç) Arasında Olanlar            ...         Den                      215 'e"]
[null,null,"DERECE",1,2,3,4,5,6,7,8,9,null,null,null,null,null,null,"6400 (Dahil) - 7600 (Hariç) Arasında Olanlar            180         Den                      195 'e"]
[null,null,1,1320,1380,1440,1500," --"," --"," --"," --"," --",null,null,null,null,null,null,"4800 (Dahil) - 6400 (Hariç) Arasında Olanlar            150         Den                      165 'e"]
[null,null,2,1155,1210,1265,1320,1380,1440," --"," --"," --",null,null,null,null,null,null,"3600 (Dahil) - 4800 (Hariç) Arasında Olanlar            130         Den                      145 'e"]
[null,null,3,1020,1065,1110,1155,1210,1265,1320,1380," --",null,null,null,null,null,null,"2200 (Dahil) -36000 (Hariç) Arasında Olanlar             70         Den                        85 'e"]
[null,null,4,915,950,985,1020,1065,1110,1155,1210,1265,null,null,null,null,null,null,"Digerleri                                                                       40          Den                        55 'e"]
{"$rows_left_out":280}
{"sheet":"Bordro","index":10,"n_rows":39,"n_cols":7,"rows_kept":39,"cut":false,"hidden":false,"merged":[[4,2,4,6],[5,2,5,6],[6,2,6,6],[7,1,7,2],[7,3,7,4],[7,5,7,6]]}
[]
[]
[]
[]
[null,"Kurumu / Birimi",{"$f":"IF(C9=0,0,CONCATENATE(+'Bilgi Girişi'!G3,\" / \",'Bilgi Girişi'!J4))","v":0}]
[null,"Ait Olduğu Ay",{"$f":"+'Bilgi Girişi'!G4","v":0}]
[null,"Bütçe Yılı",{"$f":"IF(C9=0,0,+'Bilgi Girişi'!H4)","v":0}]
[null,"PERSONEL BİLGİLERİ",null,"GELİRİN",null,"KESİNTİNİN"]
{"$rows_left_out":32}
{"sheet":"Sayfa1","index":11,"n_rows":0,"n_cols":0,"rows_kept":0,"cut":false,"hidden":false,"merged":[]}