{"text_format":"1","workbook":"xlsx","n_sheets":9,"sheets":["Bilgi Girişi","Bordro","Hesaplamalar","Tablo","Ödeme Emri","Değerler Tablosu","Asg Geç İnd","Vergi","Derece Kademe"],"not_rendered":{"charts":0,"images":0,"macros":1,"external_links":0,"defined_names":8,"comments":5,"pivot_tables":0},"unopened":[],"bounds":{"document_bytes":16777216,"sheet_cells":100000,"rows_first":2000,"rows_last":500,"rows_between":2000,"halvings":0,"cell_chars":16384,"cell_head_chars":4096},"cells_cut":0,"cells_raw":0,"read":"whole","date_system":"1900"}

{"sheet":"Bilgi Girişi","index":0,"n_rows":155,"n_cols":9,"rows_kept":155,"cut":false,"hidden":false,"merged":[[4,2,4,8],[27,3,27,4],[28,3,28,4],[15,7,15,8],[24,3,24,4],[7,3,7,4],[10,3,10,4],[8,3,8,4],[9,3,9,4],[7,7,7,8],[8,7,8,8],[9,7,9,8],[25,3,25,4],[26,3,26,4],[14,3,14,4],[20,3,20,4],[10,7,10,8],[25,7,25,8],[24,7,24,8],[17,7,17,8],[18,7,18,8],[22,7,22,8],[13,7,13,8],[23,3,23,4],[1,2,1,6],[2,3,2,6],[3,5,3,6],[11,3,11,4],[5,2,5,8],[6,7,6,8],[6,3,6,4],[13,3,13,4],[22,3,22,4],[19,3,19,4],[21,3,21,4],[14,7,14,8],[19,7,19,8],[20,7,20,8],[15,3,15,4]]}
[]
[null,null,"Hesaplamaya İlişkin Mevcut Maaş ve Kişisel Bilgilerinizi Aşağıdaki Personel Bilgileri Alanına Giriniz",null,null,null,null,"Kıst Maaşmı"]
[null,null,"Kurum :","Afyon Kocatepe Üniveritesi",null,null,null,"Ay Günü:",30]
[null,1,"Ay / YIL",null,{"$f":"+'Değerler Tablosu'!E5","v":2017},"Strateji Gel Dai Bşk.",null,"Bordro Günü",30]
[null,null,"Personel Bilgileri"]
[null,null,"KİŞİSEL BİLGİLER"]
[0,2,"Personel Durumu",null,null,{"$f":"IF(D7=\"\",0,B30+1)","v":0},{"$f":"IF(D7=\"\",\"\",IF(D14='Bilgi Girişi'!C84,0,\"Özel Hizmet Tazminatı Oranı %\"))","v":""}]
[null,{"$f":"IF(D7=\"\",\"\",3)","v":""},{"$f":"IF(D7=\"\",\"\",\"T.C. Kimlik Numarası\")","v":""},null,null,{"$f":"IF($D$7=\"\",0,F7+1)","v":0},{"$f":"IF(D7=\"\",\"\",IF(D14='Bilgi Girişi'!C84,0,\"Mali Sorumluk Zammı Puanı\"))","v":""}]
[null,{"$f":"IF(D7=\"\",\"\",B8+1)","v":""},{"$f":"IF(D7=\"\",\"\",\"Kurum Sicil Numarası\")","v":""},null,null,{"$f":"IF($D$7=\"\",0,F8+1)","v":0},{"$f":"IF(D7=\"\",\"\",IF(D14='Bilgi Girişi'!C84,0,\"İş Riski Zammı Puanı\"))","v":""}]
[null,{"$f":"IF(D7=\"\",\"\",B9+1)","v":""},{"$f":"IF(D7=\"\",\"\",\"Emekli sicil Numarası\")","v":""},null,null,0,{"$f":"IF(D7=\"\",\"\",IF(D14='Bilgi Girişi'!C84,0,\"Tem.Güç.Zammı Puanı\"))","v":""}]
{"$rows_left_out":146}
{"sheet":"Bordro","index":1,"n_rows":38,"n_cols":7,"rows_kept":38,"cut":false,"hidden":false,"merged":[[4,2,4,6],[5,2,5,6],[6,2,6,6],[7,1,7,2],[7,3,7,4],[7,5,7,6]]}
[]
[]
[]
[]
[null,"Kurumu / Birimi",{"$f":"IF(C9=0,0,CONCATENATE(+'Bilgi Girişi'!D3,\"  \",'Bilgi Girişi'!J3,\"  \",'Bilgi Girişi'!F4))","v":0},null,null,"Gelir Toplamı","2182.92"]
[null,"Ait Olduğu Ay",{"$f":"+'Bilgi Girişi'!D4","v":0},null,null,"Kesinti Toplamı","495.05"]
[null,"Bütçe Yılı",{"$f":"IF(C9=0,0,+'Bilgi Girişi'!E4)","v":0},null,null,"Net �denen","1687.87"]
[null,"PERSONEL BİLGİLERİ","10636518190","GELİRİN",null,"KESİNTİNİN"]
[null,{"$f":"IF(C9=0,0,\"T.C. Kimlik Numarası\")","v":0},{"$f":"+'Bilgi Girişi'!D8","v":0},"ADI","T U T A R I","ADI","T U T A R I"]
[null,{"$f":"IF(C10=0,0,\"Adı Soyadı\")","v":0},{"$f":"+'Bilgi Girişi'!D11","v":0},{"$f":"IF(E10=0,0,\"Aylık Tutar\")","v":0},{"$f":"+Hesaplamalar!E6","v":0},{"$f":"IF(G10=0,0,\"Gelir Vergisi\")","v":0},{"$f":"+Hesaplamalar!U9","v":0}]
{"$rows_left_out":29}
{"sheet":"Hesaplamalar","index":2,"n_rows":37,"n_cols":21,"rows_kept":37,"cut":false,"hidden":false,"merged":[[11,4,11,5],[5,16,5,17],[6,12,6,13],[5,8,5,9],[5,4,5,5],[8,16,8,17],[8,12,8,13],[7,8,7,9],[30,4,30,5],[6,4,6,5],[3,15,3,17],[7,16,7,17],[11,16,11,17],[17,4,17,5],[3,3,3,5],[4,11,4,13],[4,7,4,9],[11,8,11,9],[10,4,10,5],[6,8,6,9],[7,4,7,5],[26,4,26,5],[27,4,27,5],[6,16,6,17],[18,8,18,9],[25,3,25,5],[22,4,22,5],[15,3,15,5],[12,8,12,9],[16,4,16,5],[20,3,20,5],[23,4,23,5],[20,8,20,9],[12,4,12,5],[17,8,17,9],[13,8,13,9],[15,8,15,9],[16,8,16,9],[13,4,13,5],[23,9,28,10],[29,4,29,5],[2,19,2,20],[4,16,4,17],[4,4,4,5],[21,3,21,5],[14,8,14,9],[12,16,12,17],[9,12,9,13],[10,12,10,13],[7,12,7,13],[5,12,5,13],[8,4,8,5],[9,4,9,5],[8,8,8,9],[9,8,9,9],[10,8,10,9]]}
[]
[]
[null,null,null,null,null,null,null,null,null,null,null,null,null,null,null,null,null,null,null,"KESİNTİLER"]
[null,null,null,"Temel Maaşlar",null,null,null,null,null,null,null,null,null,null,null,"Emekli Keseneği Hesaplamaya İlşikin Bölüm",null,null,null,"Kesintinin Adı","Tutarı"]
[null,null,null,{"$f":"IF('Bilgi Girişi'!D7=\"\",\"\",\"Maaş Göstergesi\")","v":""},{"$f":"IF(ISERROR(VLOOKUP('Bilgi Girişi'!E62,'Derece Kademe'!N17:O287,2,FALSE)),0,VLOOKUP('Bilgi Girişi'!E62,'Derece Kademe'!N17:O287,2,FALSE))","v":0},null,null,"Zam ve Tazminatlar",null,null,null,"Ödenekler",null,null,null,{"$f":"IF('Bilgi Girişi'!D7='Bilgi Girişi'!C80,\"Em.Kes.Katkı Oranı % Her İki Ek Göst Eşit Olanlar\",0)","v":0},{"$f":"IF('Bilgi Girişi'!D22>6400,215,IF(P5=0,0,+S5))","v":0},null,{"$f":"LARGE('Değerler Tablosu'!I45:I51,1)","v":55},{"$f":"IF('Bilgi Girişi'!D7=\"\",\"\",\"Bu Ay Vergi Matrahınız\")","v":""},{"$f":"IF(I24>0,SUM((E6+E14+E10+E12+L27+M6)-(U14+'Bilgi Girişi'!D26+U6+U18+U15+U19+E30)),SUM((E6+E14+E10+E12+I8+M6)-(U14+'Bilgi Girişi'!D26+U6+U18+U15+U19+E30)))","v":0}]
[null,null,null,{"$f":"IF('Bilgi Girişi'!D7=\"\",\"\",\"Aylık Tutar (Ödemeye Esas)\")","v":""},{"$f":"ROUND((IF(ISERROR(((E5*'Değerler Tablosu'!E6)/'Bilgi Girişi'!I3)*'Bilgi Girişi'!I4),0,(E5*'Değerler Tablosu'!E6)/'Bilgi Girişi'!I3)*'Bilgi Girişi'!I4),2)","v":0},null,null,{"$f":"IF('Bilgi Girişi'!D7=\"\",\"\",IF('Bilgi Girişi'!G7=0,0,\"Ödemeye Esas Özel Hizmet Tazminatı Tutarı\"))","v":""},{"$f":"ROUND(((((9500*'Değerler Tablosu'!E6)/100)*'Bilgi Girişi'!H7)/'Bilgi Girişi'!I3)*'Bilgi Girişi'!I4,2)","v":0},null,null,{"$f":"IF('Bilgi Girişi'!H17=\"Evet\",\"İdari Görev Tutarı\",0)","v":0},{"$f":"ROUND((((E5+'Bilgi Girişi'!D22)*'Değerler Tablosu'!E6)*'Bilgi Girişi'!I17)/100,2)","v":0},null,null,{"$f":"IF('Bilgi Girişi'!D7='Bilgi Girişi'!C80,\"Em.Kes.Katkı Tutarı Her İki Göstergesi Eşit Olanlar\",0)","v":0},{"$f":"IF(B7=B8,0,ROUND(IF(P6=0,0,('Değerler Tablosu'!E6*9500)*Q5)/100,2))","v":0},null,null,{"$f":"IF('Bilgi Girişi'!D7=\"\",\"\",\"Sakatlık İndirimi  Tutarı TL\")","v":""},{"$f":"IF(ISERROR(VLOOKUP('Bilgi Girişi'!D29,'Değerler Tablosu'!I31:J33,2,FALSE)),0,VLOOKUP('Bilgi Girişi'!D29,'Değerler Tablosu'!I31:J33,2,FALSE))","v":0}]
[null,{"$f":"CONCATENATE('Bilgi Girişi'!D7,'Bilgi Girişi'!I2)","v":""},null,{"$f":"IF('Bilgi Girişi'!D7=\"\",\"\",\"Emekliye Esas Aylık Göstergesi\")","v":""},{"$f":"IF(B7=B8,0,IF(ISERROR(VLOOKUP('Bilgi Girişi'!E63,'Derece Kademe'!N17:O290,2,FALSE)),0,VLOOKUP('Bilgi Girişi'!E63,'Derece Kademe'!N17:O290,2,FALSE)))","v":0},null,null,{"$f":"IF('Bilgi Girişi'!D7=\"\",\"\",IF('Bilgi Girişi'!G8=0,0,\"Emkliye Esas Özel Hizmet Tazminatı Tutarı\"))","v":""},{"$f":"ROUND(((((9500*'Değerler Tablosu'!E6)/100)*'Bilgi Girişi'!H7)/30)*'Bilgi Girişi'!I4,2)","v":0},null,null,{"$f":"IF('Bilgi Girişi'!G18=0,0,\"Üniversite Ödeneği Tutarı\")","v":0},{"$f":"IF(L7=0,0,ROUND(IF('Bilgi Girişi'!H18=\"\",0,(((9500*'Değerler Tablosu'!E6)*'Bilgi Girişi'!H18)/100)/'Bilgi Girişi'!I3)*'Bilgi Girişi'!I4,2))","v":0},null,null,{"$f":"IF(Q7=0,0,\"Emekliye Esas Ek Gösterge Tutarı Ödemeye Esas Ek Göstergesi Aynı Olanlar\")","v":0},{"$f":"IF(B7=B8,0,IF('Bilgi Girişi'!D22='Bilgi Girişi'!D23,('Bilgi Girişi'!D23*'Değerler Tablosu'!E6),0))","v":0},null,null,{"$f":"IF('Bilgi Girişi'!D7=\"\",\"\",\"Toplam Vergi Matrahınız\")","v":""},{"$f":"'Bilgi Girişi'!D27+U5","v":0}]
[null,"01/10/2008 Den Önceki PersonelEvet",null,{"$f":"IF('Bilgi Girişi'!D7=\"\",\"\",\"Eski Emekliye Esas Aylık Göstergesi\")","v":""},{"$f":"IF(B8=B9,0,IF(ISERROR(VLOOKUP('Bilgi Girişi'!E64,'Derece Kademe'!N17:O290,2,FALSE)),0,VLOOKUP('Bilgi Girişi'!E64,'Derece Kademe'!N17:O290,2,FALSE)))","v":0},null,null,{"$f":"IF('Bilgi Girişi'!D7=\"\",\"\",IF('Bilgi Girişi'!G11=0,0,\"Ödenecek Yan Odemeler Toplamı\"))","v":""},{"$f":"ROUND((('Bilgi Girişi'!H11*'Değerler Tablosu'!E7)/'Bilgi Girişi'!I3)*'Bilgi Girişi'!I4,2)","v":0},null,null,{"$f":"IF('Bilgi Girişi'!G18=0,0,\"Eğitim Öğretim Ödeneği Tutarı\")","v":0},{"$f":"IF(L8=0,0,ROUND(IF('Bilgi Girişi'!H19=\"Evet\",(((9500*'Değerler Tablosu'!E6)/12)/'Bilgi Girişi'!I3)*'Bilgi Girişi'!I4,0),2))","v":0},null,null,{"$f":"IF('Bilgi Girişi'!D7='Bilgi Girişi'!C80,\"Em.Kes.Katkı Oranı % Emekli Ek Göst Farklı Olanlar\",0)","v":0},{"$f":"IF(P8=0,0,IF('Bilgi Girişi'!D24>6400,215,+S8))","v":0},null,{"$f":"LARGE('Değerler Tablosu'!K45:K51,1)","v":55},{"$f":"IF('Bilgi Girişi'!D7=\"\",\"\",\"Geçerli Vergi Oranınız %\")","v":""},{"$f":"IF(U7=0,0,+Vergi!C21)","v":0}]
[null,{"$f":"IF(B8=B8,1,0)","v":1},null,{"$f":"IF('Bilgi Girişi'!D7=\"\",\"\",\"Aylık Tutar Emekliye Esas\")","v":""},{"$f":"ROUND((IF((ISERROR((E8*'Değerler Tablosu'!E6)/'Bilgi Girişi'!I3)*'Bilgi Girişi'!I4),0,(E8*'Değerler Tablosu'!E6)/30)*'Bilgi Girişi'!I4),2)","v":0},null,null,{"$f":"IF('Bilgi Girişi'!D7=\"\",\"\",IF(I9<=0,0,\"Makam Tazminatı Puanı\"))","v":""},{"$f":"IF(ISERROR(VLOOKUP('Bilgi Girişi'!D15,'Değerler Tablosu'!I8:J16,2,FALSE)),0,VLOOKUP('Bilgi Girişi'!D15,'Değerler Tablosu'!I8:J16,2,FALSE))","v":0},null,null,{"$f":"IF('Bilgi Girişi'!G20>0,\"Ödemeye Easas Akademik Teşvik Ödeneği Tutarı\",0)","v":0},{"$f":"ROUND(((('Değerler Tablosu'!E6*9500)*'Bilgi Girişi'!H21/100)*('Bilgi Girişi'!H20)/100),2)","v":0},null,null,{"$f":"IF(Q9=0,0,IF('Bilgi Girişi'!D7='Bilgi Girişi'!C80,\"Em.Kes.Katkı Tutarı Emekli Ek  Göstergesi Farklı Olanlar\",0))","v":0},{"$f":"IF(B7=B8,0,ROUND((('Değerler Tablosu'!E6*9500)*Q8)/100,2))","v":0},null,null,{"$f":"IF('Bilgi Girişi'!D7=\"\",\"\",\"Gelir Vergisi\")","v":""},{"$f":"ROUND(IF(U5>0,(U5*U8)/100,0)-U33,2)","v":0}]
[null,null,null,{"$f":"IF('Bilgi Girişi'!D7=\"\",\"\",\"Ödemeye Esas Taban Aylık Tutarı\")","v":""},{"$f":"IF('Bilgi Girişi'!D17=\"\",0,ROUND((('Değerler Tablosu'!E8*'Değerler Tablosu'!E9)/'Bilgi Girişi'!I3)*'Bilgi Girişi'!I4,2))","v":0},null,null,{"$f":"IF('Bilgi Girişi'!D7=\"\",\"\",IF(I10<=0,0,\"Makam Tazminatı Tutarı\"))","v":""},{"$f":"ROUND(IF(I9>0,I9*'Değerler Tablosu'!E6,0),2)","v":0},null,null,{"$f":"IF('Bilgi Girişi'!G22=0,0,\"Geliştirme Ödeneği Tutarı\")","v":0},{"$f":"IF(L10=0,0,ROUND(IF('Bilgi Girişi'!H22=\"Evet\",(((E5+'Bilgi Girişi'!D22)*'Değerler Tablosu'!E6)*'Bilgi Girişi'!I22)/100,0),2))","v":0}]
{"$rows_left_out":28}
{"sheet":"Tablo","index":3,"n_rows":65,"n_cols":20,"rows_kept":65,"cut":false,"hidden":false,"merged":[[61,19,61,20],[62,19,64,20],[62,13,64,13],[62,14,63,14],[62,15,64,15],[62,16,63,16],[57,1,64,1],[57,4,57,5],[57,19,57,20],[58,4,58,5],[58,19,58,20],[62,17,64,17],[62,18,63,18],[62,2,63,2],[62,4,64,5],[62,6,64,6],[62,7,64,11],[62,12,64,12],[59,4,59,5],[59,19,59,20],[60,19,60,20],[61,4,61,5],[36,1,38,1],[36,19,36,20],[37,3,37,4],[37,19,37,20],[38,19,38,20],[41,1,54,1],[41,19,41,20],[42,19,42,20],[43,19,43,20],[44,19,44,20],[45,19,45,20],[46,19,46,20],[47,19,47,20],[48,19,48,20],[49,3,49,4],[49,19,49,20],[50,19,50,20],[51,19,51,20],[53,19,53,20],[54,19,54,20],[27,19,27,20],[30,1,33,1],[30,19,30,20],[31,19,31,20],[32,19,32,20],[33,19,33,20],[22,19,22,20],[23,19,23,20],[24,1,26,1],[24,19,24,20],[25,19,25,20],[26,19,26,20],[13,20,13,21],[14,1,21,1],[14,20,14,21],[15,19,15,20],[16,19,16,20],[17,19,17,21],[18,19,18,20],[19,19,19,20],[20,19,20,20],[21,19,21,21],[1,19,1,20],[2,19,2,20],[5,1,12,1],[5,19,5,20],[6,19,6,20],[7,19,7,20],[8,19,8,20],[9,19,9,20],[10,19,10,20],[11,19,11,20],[12,19,12,20]]}
[]
[null,null,null,null,null,null,null,null,null,"5510 Sayılı Kanuna Göre 4/c kapsamında 01/10/2008 den Önce Memuriyete Başlayanlar ",null,null,null,null,null,null,null," 5510 Sayılı Kanuna Göre 4/c kapsamında 01/10/2008 den Sonra Memuriyete Başlayanlar ",null,"5510 Sayılı Kanuna Göre 4/c kapsamında 01/10/2008 den Önce Memuriyete Başlayanlar "]
[null,"Harcama Gurubu",null,"Harcama Kalemi",null,"Damga Vergisi",null,"Gelir Vergisi",null,"Emekli Keseneği",null,"Tasarruf Kesintisi",null,"Döner Sermaye",null,"Vergi İndirimi",null,"Malüllük  Yaşlılık ve Ölüm  & Genel Sağlık Siğortası Primi",null,"\"01/07/2008 den itibaren 3 yıl Sonra \"  18/12/2009 tarih ve 27436 sayılıR.G Yayımlanan KAMU PERSONELİNİN GENEL SAĞLIK SİGORTASI KAPSAMINA\nALINMASI HAKKINDA TEBLİĞ 5.Maddesi\nGenel Sağlık Siğortası Primi  % 12 Tamamı İşverenden"]
[]
[]
[null,"Temel Maaşlar      (Eski 110)",null,"MAAŞ",null,"Tabi",null,"Tabi",null,"-----",null,"Tabi",null,"Tabi",null," ------",null," ------",null,"-----"]
[null,null,null,"EMEKLİ MAAŞI",null," ------",null,"----",null,"Tabi",null,"-----",null,"-----",null," ------",null,"Tabi",null,"Tabi"]
[null,null,null,"TABAN MAAŞ",null,"Tabi",null,"Tabi",null,"Tabi",null,"Tabi",null," ------",null," ------",null,"Tabi",null,"Tabi"]
[null,null,null,"KIDEM",null,"Tabi",null,"Tabi",null,"Tabi",null,"Tabi",null," ------",null," ------",null,"Tabi",null,"Tabi"]
[null,null,null,"EK GOSTERGE",null,"Tabi",null,"Tabi",null," ------",null,"Tabi",null,"Tabi",null," ------",null," ------",null," ------"]
{"$rows_left_out":56}
{"sheet":"Ödeme Emri","index":4,"n_rows":41,"n_cols":24,"rows_kept":41,"cut":false,"hidden":false,"merged":[[1,0,1,1],[1,2,1,12],[2,0,2,1],[2,2,2,12],[2,13,2,15],[2,16,2,18],[2,19,6,19],[2,20,2,22],[3,0,4,1],[3,7,4,12],[3,13,3,15],[3,16,3,18],[3,20,3,22],[4,13,4,15],[4,16,4,18],[4,20,4,22],[5,0,5,1],[5,2,5,18],[5,20,5,22],[6,0,6,1],[6,2,6,18],[6,20,6,22],[9,2,10,2],[9,3,10,3],[9,4,10,4],[9,6,10,6],[9,7,10,7],[9,5,10,5],[7,0,10,1],[7,2,8,6],[7,7,8,10],[9,8,10,8],[9,9,10,9],[9,10,10,10],[9,13,10,13],[9,14,10,14],[9,15,10,15],[9,16,10,16],[9,18,10,19],[9,20,10,22],[7,23,10,23],[8,11,8,12],[8,13,8,16],[8,18,8,19],[8,20,8,22],[7,11,7,12],[7,13,7,17],[7,18,7,22],[9,11,10,12],[16,18,16,19],[16,20,16,22],[11,0,11,1],[11,11,11,12],[11,18,11,19],[11,20,11,22],[15,0,15,1],[15,11,15,12],[12,20,12,22],[13,20,13,22],[14,20,14,22],[15,18,15,19],[15,20,15,22],[13,18,13,19],[21,20,21,22],[22,0,22,1],[22,11,22,12],[22,18,22,19],[17,0,17,1],[17,11,17,12],[17,18,17,19],[18,20,18,22],[17,20,17,22],[18,0,18,1],[18,11,18,12],[18,18,18,19],[22,20,22,22],[19,11,19,12],[19,18,19,19],[20,0,20,1],[20,11,20,12],[20,18,20,19],[20,20,20,22],[19,20,19,22],[19,0,19,1],[23,20,23,22],[26,0,26,1],[26,11,26,12],[24,0,24,1],[28,0,28,1],[28,11,28,12],[28,18,28,19],[28,20,28,22],[29,0,29,1],[25,0,25,1],[25,11,25,12],[25,18,25,19],[27,0,27,1],[24,20,24,22],[24,11,24,12],[24,18,24,19],[25,20,25,22],[33,0,33,16],[33,18,33,19],[12,0,12,1],[12,11,12,12],[12,18,12,19],[13,0,13,1],[13,11,13,12],[31,0,31,1],[31,11,31,12],[31,18,31,19],[32,0,32,16],[32,18,32,19],[14,0,14,1],[14,11,14,12],[14,18,14,19],[29,18,29,19],[23,0,23,1],[23,11,23,12],[23,18,23,19],[21,0,21,1],[21,11,21,12],[21,18,21,19],[16,0,16,1],[16,11,16,12],[32,20,32,22],[31,20,31,22],[27,11,27,12],[27,18,27,19],[26,18,26,19],[30,0,30,1],[30,11,30,12],[30,18,30,19],[30,20,30,22],[26,20,26,22],[29,11,29,12],[29,20,29,22],[27,20,27,22]]}
[]
["Muhasebe Birimi Kodu","","??","","",null,"","","","","","","","","","","","","","","","",""]
["Muhasebe Birimi Adı","",{"$f":"+'Bilgi Girişi'!D3","v":"Afyon Kocatepe Üniveritesi"},"","",null,"","","","","","","","Bütçe Yılı","","",{"$f":"+'Bilgi Girişi'!E4","v":2017},"","","İ l g i l i n i n ","Adı, Soyadı/Ünvanı","",""]
["Kurum-Birim Kodu","",1,2,3,4,5,"Yevmiyenin","","","","","","Tarihi","","","","","","","T.C./ Vergi Kimlik No","",""]
["","",38,44,0,0,908,"","","","","","","No.su","","",0,"","","","Banka Şube Adı","",""]
["Kurum Adı","",{"$f":"+C3","v":"Afyon Kocatepe Üniveritesi"},"","",null,"","","","","","","","","","","","","","","Banka Hesap Numarası","",""]
["Birim Adı","",{"$f":"+'Bilgi Girişi'!F4","v":"Strateji Gel Dai Bşk."},null,null,null,null,null,null,null,null,null,null,null,null,null,null,null,null,"","Bağlı Olduğu Vergi Dairesi","",""]
["Hesap No","","Kurumsal Kod","","",null,"","Fonksiyonel Kod","","","","Finans","","Ekonomik /","","","","","T u t a r","","","","","Hesap / Ayrıntı Adı"]
["","","","","",null,"","","","","","Kodu","","Y. Hesap Kodu","","","","","B o r ç","","A l a c a k","","",""]
["","",1,2,3,4,5,1,2,3,4,1,"",1,2,3,4,5,{"$f":"IF(txtYil>2008,\"TL\",\"YTL\")","v":"TL"},null,{"$f":"IF(txtYil>2008,\"TL\",\"YTL\")","v":"TL"},null,null,""]
{"$rows_left_out":32}
{"sheet":"Değerler Tablosu","index":5,"n_rows":81,"n_cols":19,"rows_kept":81,"cut":false,"hidden":false,"merged":[[3,2,3,4],[7,2,7,3],[10,2,10,3],[11,2,11,3],[4,8,4,9],[5,8,5,9],[6,8,6,9],[8,9,9,9],[5,2,5,3],[4,2,4,3],[11,9,12,9],[6,2,6,3],[12,2,12,3],[8,2,8,3],[9,2,9,3],[27,2,27,3],[13,2,13,3],[17,2,17,4],[18,2,18,3],[19,2,19,3],[25,2,25,3],[26,2,26,3],[23,2,23,3],[24,2,24,3],[20,8,20,9],[20,2,20,3],[21,2,21,3],[18,17,18,18],[22,2,22,3],[34,2,34,4],[35,2,35,3],[36,2,36,3],[37,2,37,3],[38,2,38,3],[44,2,44,3],[39,2,39,3],[40,2,40,3],[41,2,41,3],[42,2,42,3],[43,2,43,3]]}
[]
[]
[null,null,null,null,null,null,null,null,"MAKAM TAZMİNATI CETVELİ (Ek: 20/3/1997-KHK-570/7 md.)"]
[null,null,"Cari Dönem"]
[null,null,"Yıl",null,2017,null,null,null,"MAKAM TAZMİNATI",null,null,null,null,null,"Akademik",null,null,"Y.DİL TAZMİNATI"]
[null,null,"Maaş Katsayısı",null,0.10270600000000001,null,null,null,"Mak.Taz.Göst. X Maaş Katsayısı",null,null,null,null,null,"Y.DİL TAZMİNATI",null,null,"27/3/2006 tar.ve 29299 veya 23299 sy.R.G."]
[null,null,"Yan Ödeme Katsayısı",null,3.2570000000000002E-2,null,null,null,"(Yük.Öğrt.Personel Kan.Ek Mad.2(Ek:20/3/1997-KHK-570/7 Md.)",null,null,null,null,null,"A",900,null,"A1 İçin","100 -96  Puan"]
[null,null,"Taban Aylık Katsayısı",null,1.607645,null,null,null,"Rektör",7000,null,null,null,null,"B",600,null,"A   İçin","  90 -95  Puan"]
[null,null,"Taban Aylık Çarpanı",null,1000,null,null,null,"3 Yıllık Profesör",6000,null,null,null,null,"C",300,null,"B   İçin","  80 -89  Puan "]
[null,null,"Aile Yardımı Puanı",null,2134,null,null,null," (Bu kadroda üç yılını tamamlamış olmak şartıyla)",null,null,null,null,null,"D",2100,null,"C   İçin","  70 -79 Puan"]
{"$rows_left_out":72}
{"sheet":"Asg Geç İnd","index":6,"n_rows":18,"n_cols":25,"rows_kept":18,"cut":false,"hidden":false,"merged":[[1,7,1,15]]}
[]
[{"$f":"COUNTIF(A4:A33,\">0\")","v":1}]
["Sıra No","Adı Soyadı","Medeni Hali",null,"Eşi Çalışıyormu","Çocuk Sayısı","İlgili  Döneme Ait Maaşındaki Vergi Matrahı","Sakatlık İndirimi (Varsa)","GELİR VERGİSİNE TABİ GELİRİ","İlgili Dönemde Kendisinden Kesilen  Gelir Vergisi tutarı","16 Yaşından Büyükler İçin Asgari Ücret (Günlük)","16 Yaşından Büyükler İçin Asgari Ücret (Yıllık)","Asgari Geçim İndirimine Esas Tutar","Asgari Geçim İndiriminin Yıllık Tutarı","Hesaplanan Yıllık Tutarın 1/12 si","İlgili Dönemde Mükellefin (Çalışanın) Ödeyeceği Vergi Tutarı","Çalışan Personel İçin","Eşi İçin","1.Çocuk","2.Çocuk","3.Çocuk","4.Çocuk","5.Çocuk","TOPLAM İnd.Oranı","Ödenecek İndirim Tutarı"]
[1,{"$f":"+'Bilgi Girişi'!D11","v":0},{"$f":"+'Bilgi Girişi'!D12","v":0},{"$f":"MID(C4,10,10)","v":""},{"$f":"IF(A4<=0,\"\",IF(D4=\"Çalışıyor\",\"Evet\",IF(C4=\"Dul\",\"\",IF(C4=\"Bekar\",\"\",IF(D4=\"Çalışmıyor\",\"Hayır\",IF(C4=\"Evli Eşi Emekli V.İnd Yararlanıyor\",\"Hayır\",\"\"))))))","v":""},{"$f":"SUM('Bilgi Girişi'!D13+'Bilgi Girişi'!E13)","v":0},{"$f":"+Hesaplamalar!U5","v":0},null,{"$f":"G4-H4","v":0},{"$f":"ROUND((I4*0.15),2)","v":0},{"$f":"IF(A4<=0,0,'Değerler Tablosu'!E13)","v":59.25},{"$f":"(K4*30)*12","v":21330},{"$f":"ROUND((L4*X4)/100,2)","v":10665},{"$f":"ROUND((M4*0.15),2)","v":1599.75},{"$f":"ROUND((N4/12),2)","v":133.31},{"$f":"IF(J4-O4<0,0,J4-O4)","v":0},{"$f":"IF(A4<=0,0,50)","v":50},{"$f":"IF(E4=\"Hayır\",10,0)","v":0},{"$f":"IF(F4=0,0,IF(F4=1,7.5,IF(F4>1,7.5)))","v":0},{"$f":"IF(F4=0,0,IF(F4>1,7.5,))","v":0},{"$f":"IF(F4>2,10,0)","v":0},{"$f":"IF(F4>3,5,0)","v":0},{"$f":"IF(F4>4,5,0)","v":0},{"$f":"SUM(Q4:W4)","v":50},{"$f":"IF('Bilgi Girişi'!I2=\"Evet\",0,IF(J4<O4,+J4,+O4))","v":0}]
[]
[]
[]
[]
[]
[]
{"$rows_left_out":9}
{"sheet":"Vergi","index":7,"n_rows":42,"n_cols":12,"rows_kept":42,"cut":false,"hidden":false,"merged":[[0,2,0,4],[2,4,2,5],[3,4,3,5],[4,4,4,5],[5,4,5,5]]}
[null,null,{"$f":"CONCATENATE(C2,\" \",\"Yılı İçin\")","v":"2017 Yılı İçin"}]
[null,"Yıl",2017]
[1,"1.Dilim",13000,null,{"$f":"CONCATENATE(C3,\" \",\"TL'ye kadar\",\" \",\"(0\",\"-\",C3,\".-TL)\")","v":"13000 TL'ye kadar (0-13000.-TL)"},null,0.15,null,null,null,{"$f":"ROUND(C3*0.15,2)","v":1950}]
[2,"2.Dilim",30000,null,{"$f":"CONCATENATE(C4,\"-TL'nin\",\" \",C3,\"-TL'si için\",\" \",K3,\"-TL, fazlası\",\"( \",C4,\"-\",C3,\"-TL)\")","v":"30000-TL'nin 13000-TL'si için 1950-TL, fazlası( 30000-13000-TL)"},null,0.2,null,null,null,{"$f":"ROUND((C4-C3)*0.2,2)","v":3400},{"$f":"K4+K3","v":5350}]
[3,"3:dilim",110000,null,{"$f":"CONCATENATE(C5,\"-TL'nin\",\" \",C4,\" \",\"- TL'si için\",\" \",L4,\"-TL\",\" \",\"fazlası\",\"(\",C5,\"-\",C4,\"-TL)\")","v":"110000-TL'nin 30000 - TL'si için 5350-TL fazlası(110000-30000-TL)"},null,0.27]
[null,null,null,null,{"$f":"CONCATENATE(C5,\" \",\"-TL'den fazlası\")","v":"110000 -TL'den fazlası"},null,0.35]
[]
[]
[]
[]
{"$rows_left_out":33}
{"sheet":"Derece Kademe","index":8,"n_rows":287,"n_cols":29,"rows_kept":287,"cut":false,"hidden":false,"merged":[[1,3,1,11],[2,4,2,9]]}
[]
[null,null,null,"1 Numaralı Cetvel"]
[null,null,null,null,"Aylık GÖSTERGE TABLOSU (1)",null,null,null,null,null,null,null,null,null,null,null,null,null,"7600 (Dahil) - 8400 (Hariç) Arasında Olanlar            ...         Den                      215 'e"]
[null,null,"DERECE",1,2,3,4,5,6,7,8,9,null,null,null,null,null,null,"6400 (Dahil) - 7600 (Hariç) Arasında Olanlar            180         Den                      195 'e"]
[null,null,1,1320,1380,1440,1500," --"," --"," --"," --"," --",null,null,null,null,null,null,"4800 (Dahil) - 6400 (Hariç) Arasında Olanlar            150         Den                      165 'e"]
[null,null,2,1155,1210,1265,1320,1380,1440," --"," --"," --",null,null,null,null,null,null,"3600 (Dahil) - 4800 (Hariç) Arasında Olanlar            130         Den                      145 'e"]
[null,null,3,1020,1065,1110,1155,1210,1265,1320,1380," --",null,null,null,null,null,null,"2200 (Dahil) -36000 (Hariç) Arasında Olanlar             70         Den                        85 'e"]
[null,null,4,915,950,985,1020,1065,1110,1155,1210,1265,null,null,null,null,null,null,"Digerleri                                                                       40          Den                        55 'e"]
[null,null,5,835,865,895,915,950,985,1020,1065,1110]
[null,null,6,760,785,810,835,865,895,915,950,985]
{"$rows_left_out":277}